{"text_format":"1","workbook":"xlsx","n_sheets":8,"sheets":["Team Info","Team List Summary Form","Team Uniform Order","Principal Permission","Team Checklist","Training Attendance","Team Contacts","Sheet2"],"not_rendered":{"charts":0,"images":2,"macros":1,"external_links":0,"defined_names":58,"comments":0,"pivot_tables":0},"unopened":[],"bounds":{"document_bytes":16777216,"sheet_cells":100000,"rows_first":2000,"rows_last":500,"rows_between":2000,"halvings":0,"cell_chars":16384,"cell_head_chars":4096},"cells_cut":0,"cells_raw":0,"read":"whole","date_system":"1900"}

{"sheet":"Team Info","index":0,"n_rows":46,"n_cols":14,"rows_kept":46,"cut":false,"hidden":false,"merged":[[3,2,3,5],[3,11,3,12],[5,2,5,5],[8,3,8,4],[8,9,8,13],[9,9,9,13],[10,9,10,13],[11,9,11,13],[12,9,12,13],[12,3,12,4],[9,3,9,4],[10,3,10,4],[11,3,11,4]]}
[]
[{"$f":"\"Sport Team: \"&C4","v":"Sport Team: "}]
[]
["Team:",null,null,null,null,null,null,{"$f":"VLOOKUP(C4,Sheet2!A2:H75,7)","v":{"$error":"#N/A"}},null,null,"As at:",{"$f":"NOW()","v":"2024-03-26T11:28:25.980"}]
[]
["Region:",null,"Sunshine Coast",null,null,null,null,{"$f":"VLOOKUP(C4,Sheet2!A2:H75,8)","v":{"$error":"#N/A"}}]
[]
["Team Officials"]
["Position","First Name","Last name","School",null,"Gender (M/F)",null,"Consent","Mobile Phone","Email"]
[]
[]
[]
[]
[]
["Team Members"]
{"$rows_left_out":32}
{"sheet":"Team List Summary Form","index":1,"n_rows":53,"n_cols":9,"rows_kept":53,"cut":false,"hidden":false,"merged":[[51,1,51,2],[52,1,52,2],[53,1,54,2],[9,1,9,2],[9,3,9,4],[47,1,48,2],[48,3,48,7],[49,1,50,2],[49,3,50,7],[52,3,52,4],[1,1,1,8],[3,7,4,8],[5,1,5,2],[5,3,5,4],[7,1,7,2],[7,3,7,4]]}
[]
[null,"Queensland Representative School Sport Team List Summary Form"]
[null,null,"**This is to be completed at district, regional and state levels of the representative sport pathway"]
[]
[]
[null,"District/Region (if required):",null,{"$f":"'Team Info'!C6","v":"Sunshine Coast"}]
[]
[null,"Sport:",null,{"$f":"VLOOKUP('Team Info'!C4,Sheet2!A2:H75,2)","v":{"$error":"#N/A"}},null,null,null,"Age Group:",{"$f":"VLOOKUP('Team Info'!C4,Sheet2!A2:H75,3)","v":{"$error":"#N/A"}}]
[]
[null,"Submitted to:",null,null,null,null,null,"Gender:",{"$f":"VLOOKUP('Team Info'!C4,Sheet2!A2:H75,4)","v":{"$error":"#N/A"}}]
[]
[]
[null,"Playing Number","Role"," Name (First Name Surname)","School","Gender M/F","DOB DD/MM/YY","Replacement code for name if required.","Details of Name Consent"]
[null,null,{"$f":"IF(ISBLANK('Team Info'!A10),\"\",'Team Info'!A10)","v":""},{"$f":"IF(ISBLANK('Team Info'!B10),\"\",'Team Info'!B10&\" \"&'Team Info'!C10)","v":""},{"$f":"IF(ISBLANK('Team Info'!D10),\"\",'Team Info'!D10)","v":""},{"$f":"IF(ISBLANK('Team Info'!F10),\"\",'Team Info'!F10)","v":""},null,null,{"$f":"IF(ISBLANK('Team Info'!H10),\"\",'Team Info'!H10)","v":""}]
[null,null,{"$f":"IF(ISBLANK('Team Info'!A11),\"\",'Team Info'!A11)","v":""},{"$f":"IF(ISBLANK('Team Info'!B11),\"\",'Team Info'!B11&\" \"&'Team Info'!C11)","v":""},{"$f":"IF(ISBLANK('Team Info'!D11),\"\",'Team Info'!D11)","v":""},{"$f":"IF(ISBLANK('Team Info'!F11),\"\",'Team Info'!F11)","v":""},null,null,{"$f":"IF(ISBLANK('Team Info'!H11),\"\",'Team Info'!H11)","v":""}]
{"$rows_left_out":39}
{"sheet":"Team Uniform Order","index":2,"n_rows":40,"n_cols":9,"rows_kept":40,"cut":false,"hidden":false,"merged":[[3,1,3,4],[5,1,5,4],[3,7,3,8]]}
[]
[{"$f":"\"Team Uniform Order: \"&B4","v":"Team Uniform Order: 0"}]
[]
["Team:",{"$f":"'Team Info'!C4","v":0},null,null,null,null,"As at:","2023-05-11T14:52:21.180"]
[]
["Region:",{"$f":"'Team Info'!C6","v":"Sunshine Coast"}]
[]
[]
["Team members made-to-order request"]
["Gender (M/F)","First Name","Last Name","School","Playing No",{"$f":"'Team Info'!J16","v":{"$error":"#N/A"}},"QTY",{"$f":"'Team Info'!L16","v":{"$error":"#N/A"}},"QTY"]
[{"$f":"IF(ISBLANK('Team Info'!F17),\"\",'Team Info'!F17)","v":""},{"$f":"IF(ISBLANK('Team Info'!C17),\"\",'Team Info'!C17)","v":""},{"$f":"IF(ISBLANK('Team Info'!D17),\"\",'Team Info'!D17)","v":""},{"$f":"IF(ISBLANK('Team Info'!E17),\"\",'Team Info'!E17)","v":""},{"$f":"IF('Team Info'!N17=\"Withdrawn\",\"WITHDRAWN\",'Team Info'!A17)","v":1},{"$f":"IF(ISBLANK('Team Info'!J17),\"\",IF('Team Info'!N17=\"Withdrawn\",\"** WD **\",'Team Info'!J17))","v":""},{"$f":"IF(ISBLANK('Team Info'!K17),\"\",'Team Info'!K17)","v":""},{"$f":"IF(ISBLANK('Team Info'!L17),\"\",IF('Team Info'!N17=\"Withdrawn\",\"** WD **\",'Team Info'!L17))","v":""},{"$f":"IF(ISBLANK('Team Info'!M17),\"\",'Team Info'!M17)","v":""}]
[{"$f":"IF(ISBLANK('Team Info'!F18),\"\",'Team Info'!F18)","v":""},{"$f":"IF(ISBLANK('Team Info'!C18),\"\",'Team Info'!C18)","v":""},{"$f":"IF(ISBLANK('Team Info'!D18),\"\",'Team Info'!D18)","v":""},{"$f":"IF(ISBLANK('Team Info'!E18),\"\",'Team Info'!E18)","v":""},{"$f":"IF('Team Info'!N18=\"Withdrawn\",\"WITHDRAWN\",'Team Info'!A18)","v":2},{"$f":"IF(ISBLANK('Team Info'!J18),\"\",IF('Team Info'!N18=\"Withdrawn\",\"** WD **\",'Team Info'!J18))","v":""},{"$f":"IF(ISBLANK('Team Info'!K18),\"\",'Team Info'!K18)","v":""},{"$f":"IF(ISBLANK('Team Info'!L18),\"\",IF('Team Info'!N18=\"Withdrawn\",\"** WD **\",'Team Info'!L18))","v":""},{"$f":"IF(ISBLANK('Team Info'!M18),\"\",'Team Info'!M18)","v":""}]
[{"$f":"IF(ISBLANK('Team Info'!F19),\"\",'Team Info'!F19)","v":""},{"$f":"IF(ISBLANK('Team Info'!C19),\"\",'Team Info'!C19)","v":""},{"$f":"IF(ISBLANK('Team Info'!D19),\"\",'Team Info'!D19)","v":""},{"$f":"IF(ISBLANK('Team Info'!E19),\"\",'Team Info'!E19)","v":""},{"$f":"IF('Team Info'!N19=\"Withdrawn\",\"WITHDRAWN\",'Team Info'!A19)","v":3},{"$f":"IF(ISBLANK('Team Info'!J19),\"\",IF('Team Info'!N19=\"Withdrawn\",\"** WD **\",'Team Info'!J19))","v":""},{"$f":"IF(ISBLANK('Team Info'!K19),\"\",'Team Info'!K19)","v":""},{"$f":"IF(ISBLANK('Team Info'!L19),\"\",IF('Team Info'!N19=\"Withdrawn\",\"** WD **\",'Team Info'!L19))","v":""},{"$f":"IF(ISBLANK('Team Info'!M19),\"\",'Team Info'!M19)","v":""}]
[{"$f":"IF(ISBLANK('Team Info'!F20),\"\",'Team Info'!F20)","v":""},{"$f":"IF(ISBLANK('Team Info'!C20),\"\",'Team Info'!C20)","v":""},{"$f":"IF(ISBLANK('Team Info'!D20),\"\",'Team Info'!D20)","v":""},{"$f":"IF(ISBLANK('Team Info'!E20),\"\",'Team Info'!E20)","v":""},{"$f":"IF('Team Info'!N20=\"Withdrawn\",\"WITHDRAWN\",'Team Info'!A20)","v":4},{"$f":"IF(ISBLANK('Team Info'!J20),\"\",IF('Team Info'!N20=\"Withdrawn\",\"** WD **\",'Team Info'!J20))","v":""},{"$f":"IF(ISBLANK('Team Info'!K20),\"\",'Team Info'!K20)","v":""},{"$f":"IF(ISBLANK('Team Info'!L20),\"\",IF('Team Info'!N20=\"Withdrawn\",\"** WD **\",'Team Info'!L20))","v":""},{"$f":"IF(ISBLANK('Team Info'!M20),\"\",'Team Info'!M20)","v":""}]
[{"$f":"IF(ISBLANK('Team Info'!F21),\"\",'Team Info'!F21)","v":""},{"$f":"IF(ISBLANK('Team Info'!C21),\"\",'Team Info'!C21)","v":""},{"$f":"IF(ISBLANK('Team Info'!D21),\"\",'Team Info'!D21)","v":""},{"$f":"IF(ISBLANK('Team Info'!E21),\"\",'Team Info'!E21)","v":""},{"$f":"IF('Team Info'!N21=\"Withdrawn\",\"WITHDRAWN\",'Team Info'!A21)","v":5},{"$f":"IF(ISBLANK('Team Info'!J21),\"\",IF('Team Info'!N21=\"Withdrawn\",\"** WD **\",'Team Info'!J21))","v":""},{"$f":"IF(ISBLANK('Team Info'!K21),\"\",'Team Info'!K21)","v":""},{"$f":"IF(ISBLANK('Team Info'!L21),\"\",IF('Team Info'!N21=\"Withdrawn\",\"** WD **\",'Team Info'!L21))","v":""},{"$f":"IF(ISBLANK('Team Info'!M21),\"\",'Team Info'!M21)","v":""}]
{"$rows_left_out":26}
{"sheet":"Principal Permission","index":3,"n_rows":55,"n_cols":6,"rows_kept":55,"cut":false,"hidden":false,"merged":[[16,0,16,3],[18,0,18,3],[19,0,19,3],[20,0,20,3],[5,0,5,3],[6,0,6,3],[11,0,11,3],[12,0,12,3],[13,0,13,3],[15,0,15,3]]}
[]
[]
["Dear Principal,"]
[]
[]
[{"$f":"\"The students listed below have been invited to join the Sunshine Coast regional \"","v":"The students listed below have been invited to join the Sunshine Coast regional "}]
[{"$f":"'Team Info'!C4 &\" team.  Departmental approval has been given for this activity.\"","v":" team.  Departmental approval has been given for this activity."}]
[]
["State championship dates: . . . . . ."]
["Location: . . . . . . . . . . . . . . . . . . . ."]
[]
["Please confirm that each student in the list below are still enrolled at your school campus"]
["and that they have your permission to attend this activity by replying to this email and"]
["entering their date of birth in the DOB cell next to their name."]
[]
{"$rows_left_out":41}
{"sheet":"Team Checklist","index":4,"n_rows":39,"n_cols":14,"rows_kept":39,"cut":false,"hidden":false,"merged":[[3,1,3,3],[5,1,5,3]]}
[]
[{"$f":"\"Team Member Checklist: \"&B4","v":"Team Member Checklist: 0"}]
[]
["Team:",{"$f":"'Team Info'!C4","v":0}]
[]
["Region:",{"$f":"'Team Info'!C6","v":"Sunshine Coast"}]
[]
[]
["Playing No","First Name","Last Name","School","Accept Offer","Permission Form","Consent Form Returned","Principal Approval","Medical Alert","Medical Clearance","Paid","Other","Other 2","Comments"]
[{"$f":"'Team Info'!A17","v":1},{"$f":"IF(ISBLANK('Team Info'!C17),\"\",'Team Info'!C17)","v":""},{"$f":"IF(ISBLANK('Team Info'!D17),\"\",'Team Info'!D17)","v":""},{"$f":"IF(ISBLANK('Team Info'!E17),\"\",'Team Info'!E17)","v":""}]
[{"$f":"'Team Info'!A18","v":2},{"$f":"IF(ISBLANK('Team Info'!C18),\"\",'Team Info'!C18)","v":""},{"$f":"IF(ISBLANK('Team Info'!D18),\"\",'Team Info'!D18)","v":""},{"$f":"IF(ISBLANK('Team Info'!E18),\"\",'Team Info'!E18)","v":""}]
[{"$f":"'Team Info'!A19","v":3},{"$f":"IF(ISBLANK('Team Info'!C19),\"\",'Team Info'!C19)","v":""},{"$f":"IF(ISBLANK('Team Info'!D19),\"\",'Team Info'!D19)","v":""},{"$f":"IF(ISBLANK('Team Info'!E19),\"\",'Team Info'!E19)","v":""}]
[{"$f":"'Team Info'!A20","v":4},{"$f":"IF(ISBLANK('Team Info'!C20),\"\",'Team Info'!C20)","v":""},{"$f":"IF(ISBLANK('Team Info'!D20),\"\",'Team Info'!D20)","v":""},{"$f":"IF(ISBLANK('Team Info'!E20),\"\",'Team Info'!E20)","v":""}]
[{"$f":"'Team Info'!A21","v":5},{"$f":"IF(ISBLANK('Team Info'!C21),\"\",'Team Info'!C21)","v":""},{"$f":"IF(ISBLANK('Team Info'!D21),\"\",'Team Info'!D21)","v":""},{"$f":"IF(ISBLANK('Team Info'!E21),\"\",'Team Info'!E21)","v":""}]
[{"$f":"'Team Info'!A22","v":6},{"$f":"IF(ISBLANK('Team Info'!C22),\"\",'Team Info'!C22)","v":""},{"$f":"IF(ISBLANK('Team Info'!D22),\"\",'Team Info'!D22)","v":""},{"$f":"IF(ISBLANK('Team Info'!E22),\"\",'Team Info'!E22)","v":""}]
{"$rows_left_out":25}
{"sheet":"Training Attendance","index":5,"n_rows":39,"n_cols":19,"rows_kept":39,"cut":false,"hidden":false,"merged":[[3,1,3,3],[5,1,5,3]]}
[]
[{"$f":"\"Training attendance: \"&B4","v":"Training attendance: 0"}]
[]
["Team:",{"$f":"'Team Info'!C4","v":0}]
[]
["Region:",{"$f":"'Team Info'!C6","v":"Sunshine Coast"}]
[]
[]
["Playing No","First Name","Last Name","School","Date 1","Date 2","Date 3","Date 4","Date 5","Date 6","Date 7","Date 8","Date 9","Date 10","Date 11","Date 12","Date 13","Date 14","Comments"]
[{"$f":"'Team Info'!A17","v":1},{"$f":"IF(ISBLANK('Team Info'!C17),\"\",'Team Info'!C17)","v":""},{"$f":"IF(ISBLANK('Team Info'!D17),\"\",'Team Info'!D17)","v":""},{"$f":"IF(ISBLANK('Team Info'!E17),\"\",'Team Info'!E17)","v":""}]
[{"$f":"'Team Info'!A18","v":2},{"$f":"IF(ISBLANK('Team Info'!C18),\"\",'Team Info'!C18)","v":""},{"$f":"IF(ISBLANK('Team Info'!D18),\"\",'Team Info'!D18)","v":""},{"$f":"IF(ISBLANK('Team Info'!E18),\"\",'Team Info'!E18)","v":""}]
[{"$f":"'Team Info'!A19","v":3},{"$f":"IF(ISBLANK('Team Info'!C19),\"\",'Team Info'!C19)","v":""},{"$f":"IF(ISBLANK('Team Info'!D19),\"\",'Team Info'!D19)","v":""},{"$f":"IF(ISBLANK('Team Info'!E19),\"\",'Team Info'!E19)","v":""}]
[{"$f":"'Team Info'!A20","v":4},{"$f":"IF(ISBLANK('Team Info'!C20),\"\",'Team Info'!C20)","v":""},{"$f":"IF(ISBLANK('Team Info'!D20),\"\",'Team Info'!D20)","v":""},{"$f":"IF(ISBLANK('Team Info'!E20),\"\",'Team Info'!E20)","v":""}]
[{"$f":"'Team Info'!A21","v":5},{"$f":"IF(ISBLANK('Team Info'!C21),\"\",'Team Info'!C21)","v":""},{"$f":"IF(ISBLANK('Team Info'!D21),\"\",'Team Info'!D21)","v":""},{"$f":"IF(ISBLANK('Team Info'!E21),\"\",'Team Info'!E21)","v":""}]
[{"$f":"'Team Info'!A22","v":6},{"$f":"IF(ISBLANK('Team Info'!C22),\"\",'Team Info'!C22)","v":""},{"$f":"IF(ISBLANK('Team Info'!D22),\"\",'Team Info'!D22)","v":""},{"$f":"IF(ISBLANK('Team Info'!E22),\"\",'Team Info'!E22)","v":""}]
{"$rows_left_out":25}
{"sheet":"Team Contacts","index":6,"n_rows":39,"n_cols":7,"rows_kept":39,"cut":false,"hidden":false,"merged":[[3,1,3,3],[5,1,5,3]]}
[]
[{"$f":"\"Team Member Contact Info: \"&B4","v":"Team Member Contact Info: 0"}]
[]
["Team:",{"$f":"'Team Info'!C4","v":0}]
[]
["Region:",{"$f":"'Team Info'!C6","v":"Sunshine Coast"}]
[]
[]
["Playing No","First Name","Last Name","School","Parent Name","Parent Phone","Parent Email"]
[{"$f":"'Team Info'!A17","v":1},{"$f":"IF(ISBLANK('Team Info'!C17),\"\",'Team Info'!C17)","v":""},{"$f":"IF(ISBLANK('Team Info'!D17),\"\",'Team Info'!D17)","v":""},{"$f":"IF(ISBLANK('Team Info'!E17),\"\",'Team Info'!E17)","v":""}]
[{"$f":"'Team Info'!A18","v":2},{"$f":"IF(ISBLANK('Team Info'!C18),\"\",'Team Info'!C18)","v":""},{"$f":"IF(ISBLANK('Team Info'!D18),\"\",'Team Info'!D18)","v":""},{"$f":"IF(ISBLANK('Team Info'!E18),\"\",'Team Info'!E18)","v":""}]
[{"$f":"'Team Info'!A19","v":3},{"$f":"IF(ISBLANK('Team Info'!C19),\"\",'Team Info'!C19)","v":""},{"$f":"IF(ISBLANK('Team Info'!D19),\"\",'Team Info'!D19)","v":""},{"$f":"IF(ISBLANK('Team Info'!E19),\"\",'Team Info'!E19)","v":""}]
[{"$f":"'Team Info'!A20","v":4},{"$f":"IF(ISBLANK('Team Info'!C20),\"\",'Team Info'!C20)","v":""},{"$f":"IF(ISBLANK('Team Info'!D20),\"\",'Team Info'!D20)","v":""},{"$f":"IF(ISBLANK('Team Info'!E20),\"\",'Team Info'!E20)","v":""}]
[{"$f":"'Team Info'!A21","v":5},{"$f":"IF(ISBLANK('Team Info'!C21),\"\",'Team Info'!C21)","v":""},{"$f":"IF(ISBLANK('Team Info'!D21),\"\",'Team Info'!D21)","v":""},{"$f":"IF(ISBLANK('Team Info'!E21),\"\",'Team Info'!E21)","v":""}]
[{"$f":"'Team Info'!A22","v":6},{"$f":"IF(ISBLANK('Team Info'!C22),\"\",'Team Info'!C22)","v":""},{"$f":"IF(ISBLANK('Team Info'!D22),\"\",'Team Info'!D22)","v":""},{"$f":"IF(ISBLANK('Team Info'!E22),\"\",'Team Info'!E22)","v":""}]
{"$rows_left_out":25}
{"sheet":"Sheet2","index":7,"n_rows":250,"n_cols":55,"rows_kept":250,"cut":false,"hidden":true,"merged":[]}
["Team data",null,null,null,null,null,null,null,null,"AFLT","AFLB","BaseballT","BaseballB","BasketballT","BasketballB","CricketT","CricketB","FootballT","FootballB","FutsalT","FutsalB","GolfT","GolfB","HockeyT","HockeyB","gHockeyT","gHockeyB","NetballT","NetballB","RLT","RLB","RUT","RUB","SoftballT","SoftballB","SurfingT","SurfingB","SwimmingT","SwimmingB","TennisT","TennisB","TouchT","TouchB","gTouchT","gTouchB","VolleyballT","VolleyballB","gVolleyballT","gVolleyballB","WPT","WPB","WPT","WPB","NBT","NBB"]
["Australian Football (10-12 boys)","Australian Football","10-12","boys","Playing Top Size","Playing Bottom Size","AFLT","AFLB",null,"-","-","-","-","-","-","-","-","-","-","-","-","-","N/A","-","-","-","-","-","N/A","-","-","-","-","-","N/A","N/A","N/A","N/A","N/A","-","N/A","-","-","-","-","-","-","-","N/A","N/A","3XS","6","N/A","C08","C08"]
["Australian Football (10-12 girls)","Australian Football","10-12","girls","Playing Top Size","Playing Bottom Size","AFLT","AFLB",null,"C08","C08","C08","C08","C08","C08","C08","C08","C08","C08","C08","C08","C08",null,"C08","C08","C08","C10","C08","-","K8","24","C10","C10","C08",null,null,null,null,null,"C08",null,"C08","C08","C08","C08","C08","C08","C08",null,null,"2XS","8",null,"C10","C10"]
["Australian Football (13-15 boys)","Australian Football","13-15","boys","Playing Top Size","Playing Bottom Size","AFLT","AFLB",null,"C10","C10","C10","C10","C10","C10","C10","C10","C10","C10","C10","C10","C10",null,"C10","C10","C10","C12","C10","K8","K10","26","C12","C12","C10",null,null,null,null,null,"C10",null,"C10","C10","C10","C10","C10","C10","C10",null,null,"XS","10",null,"C12","C12"]
["Australian Football (13-15 girls)","Australian Football","13-15","girls","Playing Top Size","Playing Bottom Size","AFLT","AFLB",null,"C12","C12","C12","C12","C12","C12","C12","C12","C12","C12","C12","C12","C12",null,"C12","C12","C12","C14","C12","K10","K12","28","C14","C14","C12",null,null,null,null,null,"C12",null,"C12","C12","C12","C12","C12","C12","C12",null,null,"S","12",null,"C14","C14"]
["Baseball (12-14 years)","Baseball","12-14","boys & girls","Overshirt Size","Undershirt Size","BaseballT","BaseballB",null,"C14","C14","C14","C14","C14","C14","C14","C14","C14","C14","C14","C14","C14",null,"C14","C14","C14","L08","C14","K12","K14","30","C16","2XS","C14",null,null,null,null,null,"C14",null,"C14","C14","L8","C14","C14","C14","L8",null,null,"M","14",null,"2XS","XS"]
["Baseball (15-18 years)","Baseball","15-18","boys & girls","Overshirt Size","Undershirt Size","BaseballT","BaseballB",null,"XS","XS","XS","XS","XS","XS","L08","L08","L08","L08","L08","L08","L08",null,"XS","XS","L08","L10","L08","K14","XS","32","XS","XS","L08",null,null,null,null,null,"L08",null,"XS","XS","L10","XS","XS","XS","L10",null,null,"L","16",null,"XS","S"]
["Basketball (10-12 boys)","Basketball","10-12 ","boys","Playing Top Size","Playing Bottom Size","BasketballT","BasketballB",null,"S","S","S","S","S","S","L10","L10","L10","L10","L10","L10","L10",null,"S","S","L10","L12","L10","XS","S","34","S","S","L10",null,null,null,null,null,"L10",null,"S","S","L12","S","S","S","L12",null,null,"XL","18",null,"S","M"]
["Basketball (10-12 girls)","Basketball","10-12","girls","Playing Top Size","Playing Bottom Size","BasketballT","BasketballB",null,"M","M","M","M","M","M","L12","L12","L12","L12","L12","L12","L12",null,"M","M","L12","L14","L12","S","M","36","M","M","L12",null,null,null,null,null,"L12",null,"M","M","L14","M","M","M","L14",null,null,"2XL",null,null,"M","L"]
["Basketball (13-16 boys)","Basketball","13-16","boys","Playing Top Size","Playing Bottom Size","BasketballT","BasketballB",null,"L","L","L","L","L","L","L14","L14","L14","L14","L14","L14","L14",null,"L","L","L14","L16","L14","M","L","38","L","L","L14",null,null,null,null,null,"L14",null,"L","L","L16","L","L","L","L16",null,null,null,null,null,"L","XL"]
["Basketball (13-16 girls)","Basketball","13-16","girls","Playing Top Size","Playing Bottom Size","BasketballT","BasketballB",null,"XL","XL","XL","XL","XL","XL","L16","L16","L16","L16","L16","L16","L16",null,"XL","XL","L16","L18","L16","L","XL","40","XL","XL","L16",null,null,null,null,null,"L16",null,"XL","XL","L18","XL","XL","XL","L18",null,null,null,null,null,"XL","2XL"]
["Basketball (17-19 boys)","Basketball","17-19","boys","Playing Top Size","Playing Bottom Size","BasketballT","BasketballB",null,"2XL","2XL","2XL","2XL","2XL","2XL","L18","L18","L18","L18","L18","L18","L18",null,"2XL","2XL","L18","L20","L18","XL","2XL","42","2XL","2XL","L18",null,null,null,null,null,"L18",null,"2XL","2XL","L20","2XL","2XL","2XL","L20",null,null,null,null,null,"2XL"]
["Basketball (17-19 girls)","Basketball","17-19","girls","Playing Top Size","Playing Bottom Size","BasketballT","BasketballB",null,"3XL",null,"3XL","3XL","3XL",null,"L20","L20","L20","L20","L20","L20","L20",null,"3XL",null,"L20",null,"L20","2XL","3XL","44","3XL","3XL","L20",null,null,null,null,null,"L20",null,"3XL",null,null,null,"3XL"]
["Cricket (10-12 boys)","Cricket","10-12","boys","Short Sleeve Size","Long Sleeve Size","CricketT","CricketB",null,"4XL",null,"4XL","4XL","4XL",null,"XS","XS","XS","XS","XS","XS","XS",null,"4XL",null,null,null,null,"3XL","4XL","46","4XL",null,"XS",null,null,null,null,null,"XS",null,"4XL",null,null,null,"4XL"]
["Cricket (10-12 girls)","Cricket","10-12","girls","Short Sleeve Size","Long Sleeve Size","CricketT","CricketB",null,null,null,null,null,null,null,"S","S","S","S","S","S","S",null,null,null,null,null,null,"4XL","5XL","48","5XL",null,"S",null,null,null,null,null,"S"]
{"$rows_left_out":235}